{"text_format":"1","workbook":"xlsx","n_sheets":9,"sheets":["Uvod","Limit","Splatkovy_kalendar","Zadost","Prohlaseni","Zprostredkovani","Data_export","Changelog","pomocne"],"not_rendered":{"charts":0,"images":23,"macros":1,"external_links":0,"defined_names":12,"comments":1,"pivot_tables":0},"unopened":[],"bounds":{"document_bytes":16777216,"sheet_cells":100000,"rows_first":2000,"rows_last":500,"rows_between":2000,"halvings":0,"cell_chars":16384,"cell_head_chars":4096},"cells_cut":0,"cells_raw":0,"read":"whole","date_system":"1900"}

{"sheet":"Uvod","index":0,"n_rows":40,"n_cols":5,"rows_kept":40,"cut":false,"hidden":false,"merged":[[30,2,32,13],[25,2,25,13],[0,0,1,15],[5,2,6,13],[10,3,10,13],[9,3,9,13],[8,2,8,13],[26,4,26,13],[27,4,27,13],[12,2,12,13],[13,3,13,13],[14,3,14,13],[16,2,16,13],[28,4,28,13],[34,2,34,13],[35,3,35,13],[36,3,36,13],[37,3,37,13],[39,2,39,13]]}
["KB  KALKULAČKA SPOTŘEBITELSKÝCH ÚVĚRŮ"]
[]
[]
[]
[]
[null,null,"V KB kalkulačce SÚ je možné modelovat různé varianty výše úvěru a splátek, ověřit bonitu žadatele (a zjistit maximální výši úvěru) a vytvořit dokument Žádost o spotřebitelský úvěr. Pro správné fungování kalkulačky viz. Důležité informace níže."]
[]
[]
[null,null,"Modelace parametrů úvěru\n\n"]
[null,null,null,"• Klikněte na \"Modelace / Vytvoření žádosti o úvěr\"."]
[null,null,null,"• Do odstavce Modelace úvěru zadejte požadované údaje. Splátkový kalendář si zobrazíte kliknutím na  \"Vypočítej splátkový kalendář\"."]
[]
[null,null,"Ověření bonity žadatele\n\n"]
[null,null,null,"• Po modelaci úvěru vyplňte příjmy a výdaje žadatele do odstavců Příjmy žadatele, Výdaje domácnosti a informace o jiných úvěrech žadatele ."]
[null,null,null,"• Klikněte na \"Ověřit bonitu žadatele\" ve spodní části obrazovky."]
[]
[null,null,"Vytvoření dokumentu Žádost o spotřebitelský úvěr\n\n"]
[null,null,null,"• Po modelaci úvěru a vyplnění údajů o příjmech a výdajích žadatele pokračujte dále kliknutím na \"Pokračovat k Žádosti o úvěr\"."]
[null,null,null,"• Vyplňte požadované informace o žadateli a pokračujte dále kliknutím na \"Pokračovat k Žádosti o úvěr\" a následně i jeho prohlášení."]
[null,null,null,"• Vyplňte požadované informace o Vás jako zprostředkovateli žádosti o úvěr. Kliknutím na  \"Vytvořit Žádost o úvěr\" se automaticky vygeneruje"]
{"$rows_left_out":21}
{"sheet":"Limit","index":1,"n_rows":66,"n_cols":13,"rows_kept":66,"cut":false,"hidden":false,"merged":[[0,0,1,14],[2,0,2,14]]}
["KB  KALKULAČKA SPOTŘEBITELSKÝCH ÚVĚRŮ"]
[]
["MODELACE ÚVĚRU A BONITA ŽADATEL > OSOBNÍ ÚDAJE  > PROHLÁŠENÍ ŽADATELE O VZTAHU KE KOMERČNÍ BANCE A JINÝCH INFORMACÍCH > INFORMACE O ZPROSTŘEDKOVATELI"]
[]
[]
[null,null,"Modelace úvěru"]
[]
[null,null,"Úvěrový produkt",null,null,"Celková výše úvěru",null,null,"Doba splácení (roky/let)",null,null,"Úroková sazba (pouze orientační)"]
[null,null,null,null,null,null,"Kč",null,null,"roky/let",null,{"$f":"pomocne!U3","v":""}]
[]
[null,null,"Počet žadatelů",null,null,"Zajištění úvěru",null,null,"Měsíční splátka"]
[null,null,null,null,null,null,null,null,{"$f":"IFERROR(pomocne!U17,\"\")","v":""},"Kč"]
[]
[]
[]
[null,null,"Příjmy hlavního žadatele"]
[]
[null,null,"Průměrný čistý měsíční příjem ze závislé činnosti dle potvrzení o příjmu",null,null,"Čistý roční příjem z podnikatelské činnosti",null,null,"Ostatní pravidelné měsíční příjmy"]
[null,null,null,"Kč",null,null,"Kč",null,null,"Kč"]
[]
{"$rows_left_out":47}
{"sheet":"Splatkovy_kalendar","index":2,"n_rows":366,"n_cols":15,"rows_kept":366,"cut":false,"hidden":false,"merged":[[0,0,1,15],[2,0,2,15]]}
["KB  KALKULAČKA SPOTŘEBITELSKÝCH ÚVĚRŮ"]
[]
[]
[]
[null,null,"Souhrnné informace o úvěru",null,null,null,null,null,"Platba","Datum splátky","Výše splátky","Z toho jistina","Z toho úrok","Zůstatek jistiny"]
[]
[null,null,{"$f":"pomocne!T2","v":"Celková výše úvěru"},{"$f":"Limit!F9","v":0},"Kč",null,null,null,1,"20.04.2020",423.45636666666672,0,423.45636666666672,444444,""]
[null,null,"Měsíční splátka",{"$f":"IFERROR(pomocne!U17,\"\")","v":""},"Kč",null,null,null,2,"2020-05-20",8493,6678.1869999999999,1814.8130000000001,437765.81300000002,""]
[null,null,{"$f":"pomocne!T3","v":"Úrok "},{"$f":"pomocne!U3","v":""},"p.a.",null,null,null,3,"2020-06-20",8493,6705.4562635833336,1787.5437364166667,431060.3567364167,""]
[null,null,{"$f":"pomocne!AG18","v":"RPSN "},{"$f":"ROUNDUP(pomocne!AH18,4)","v":5.0700000000000002E-2},null,null,null,null,4,"2020-07-20",8493,6732.8368766596313,1760.1631233403684,424327.51985975704,""]
[null,null,{"$f":"pomocne!T9","v":"Celková splatná částka"},{"$f":"pomocne!AH16","v":490},"Kč",null,null,null,5,"2020-08-20",8493,6760.329293905992,1732.670706094008,417567.19056585105,""]
[null,null,{"$f":"pomocne!AG12","v":"Poplatek za zpracování žádosti"},{"$f":"pomocne!AH12","v":490},"Kč",null,null,null,6,"2020-09-20",8493,6787.9339718561077,1705.066028143892,410779.25659399497,""]
[null,null,{"$f":"pomocne!AG13","v":"Pravidelné měsiční poplatky"},{"$f":"pomocne!AH13","v":0},"Kč",null,null,null,7,"2020-10-20",8493,6815.6513689078538,1677.3486310921462,403963.60522508714,""]
[null,null,{"$f":"pomocne!T4","v":"Počet splátek"},{"$f":"pomocne!U4","v":0},"měs.",null,null,null,8,"2020-11-20",8493,6843.4819453308937,1649.518054669106,397120.12327975623,""]
[null,null,{"$f":"pomocne!T5","v":"Datum podpisu smlouvy"},{"$f":"pomocne!U5","v":"2024-06-10"},null,null,null,null,9,"2020-12-20",8493,6871.4261632743282,1621.5738367256715,390248.6971164819,""]
[null,null,{"$f":"pomocne!T8","v":"Den pro splácení"},{"$f":"pomocne!U8","v":"20."},null,null,null,null,10,"2021-01-20",8493,6899.4844867743659,1593.5155132256343,383349.21262970753,""]
[null,null,{"$f":"pomocne!T10","v":"Datum první úrokové splátky"},{"$f":"pomocne!U10","v":"20.06.2024"},null,null,null,null,11,"2021-02-20",8493,6927.6573817620274,1565.3426182379726,376421.55524794548,""]
[null,null,{"$f":"pomocne!T12","v":"Datum první anuitní splátky"},{"$f":"pomocne!U12","v":"2024-07-20"},null,null,null,null,12,"2021-03-20",8493,6955.945316070889,1537.0546839291108,369465.60993187461,""]
[null,null,{"$f":"pomocne!AG9","v":"Datum poslední splátky"},{"$f":"pomocne!AH9","v":"2024-06-10"},null,null,null,null,13,"2021-04-20",8493,6984.3487594448452,1508.6512405551548,362481.26117242977,""]
[null,null,null,null,null,null,null,null,14,"2021-05-20",8493,7012.868183545912,1480.1318164540883,355468.39298888389,""]
{"$rows_left_out":347}
{"sheet":"Zadost","index":3,"n_rows":666,"n_cols":16,"rows_kept":666,"cut":false,"hidden":false,"merged":[[36,2,36,5],[10,8,10,14],[13,8,13,14],[10,2,10,5],[53,2,53,5],[53,8,53,14],[44,2,44,5],[43,2,43,5],[37,2,37,5],[94,8,94,11],[86,8,86,9],[87,8,87,9],[43,8,43,9],[44,8,44,9],[56,8,56,14],[54,8,54,14],[0,0,1,17],[11,8,11,14],[14,8,14,14],[11,2,11,5],[24,2,24,5],[23,2,23,5],[17,8,17,14],[16,8,16,14],[2,0,2,17],[54,2,54,5],[93,2,93,5],[93,8,93,11],[60,8,60,14],[59,8,59,14],[57,8,57,14],[87,2,87,5],[86,2,86,5],[80,2,80,5],[67,2,67,5],[66,2,66,5],[79,2,79,5],[104,2,104,5],[113,2,113,5],[110,2,110,5],[107,2,107,5],[94,2,94,5],[109,2,109,5],[106,2,106,5],[103,2,103,5],[112,2,112,5],[122,2,122,5],[124,2,124,5],[125,2,125,5],[115,2,115,5],[116,2,116,5],[118,2,118,5],[119,2,119,5],[121,2,121,5]]}
["KB  KALKULAČKA SPOTŘEBITELSKÝCH ÚVĚRŮ"]
[]
["MODELACE ÚVĚRU A BONITA ŽADATEL > OSOBNÍ ÚDAJE  > PROHLÁŠENÍ ŽADATELE O VZTAHU KE KOMERČNÍ BANCE A JINÝCH INFORMACÍCH > INFORMACE O ZPROSTŘEDKOVATELI"]
[]
[]
[null,null,"Žadatel"]
[]
[null,null,"Titul",null,null,"Jméno",null,null,"Příjmení",null,null,"Rodné číslo",null,null,"Datum narození"]
[null,null,"",null,null,"",null,null,"",null,null,"",null,null,""]
[]
[null,null,"Rodinný stav",null,null,null,null,null,"Vzdělání"]
[null,null,"",null,null,null,null,null,""]
[]
[null,null,"Bytové poměry",null,null,"Trvalé bydliště od roku",null,null,"Adresa trvalého pobytu"]
[null,null,"",null,null,"",null,null,""]
[]
[null,null,"Telefon",null,null,"Email",null,null,"Kontaktní adresa"]
[null,null,"",null,null,"",null,null,""]
[]
[]
{"$rows_left_out":647}
{"sheet":"Prohlaseni","index":4,"n_rows":48,"n_cols":11,"rows_kept":48,"cut":false,"hidden":false,"merged":[[39,4,40,15],[42,4,43,15],[47,3,47,15],[37,6,37,8],[24,3,24,15],[36,10,36,12],[31,2,31,6],[13,10,13,12],[14,6,14,8],[16,4,17,15],[19,4,20,15],[30,2,30,5],[30,7,30,15],[0,0,1,17],[7,2,7,5],[7,7,7,15],[8,2,8,6],[2,0,2,17]]}
["KB  KALKULAČKA SPOTŘEBITELSKÝCH ÚVĚRŮ"]
[]
["MODELACE ÚVĚRU A BONITA ŽADATEL > OSOBNÍ ÚDAJE  > PROHLÁŠENÍ ŽADATELE O VZTAHU KE KOMERČNÍ BANCE A JINÝCH INFORMACÍCH > INFORMACE O ZPROSTŘEDKOVATELI"]
[]
[]
[null,null,"Prohlášení žadatele o zvláštním vztahu k bance"]
[]
[null,null,"Podpisem této žádosti prohlašuji , že",null,null,null,"","osobou se zvláštním vztahem k Bance ve smyslu ustanovení § 19 z.č. 21/1992 Sb., o bankách, ve znění"]
[null,null,"pozdějších předpisů."]
[]
[null,null,"Prohlášení žadatele o daňovém rezidentství"]
[]
[null,null,"Podpisem této žádosti prohlašuji:"]
[null,null,null,"▪ že jsem k datu podpisu této žádosti daňovým rezidentem v",null,null,null,null,null,null,""]
[null,null,null,null,"DIČ v zemi daňové rezidence",null,""]
[null,null,null,"▪ že jsem skutečným vlastníkem všech příjmů, které mi plynou od Správce, jak je definován ve Všeobecných obchodních podmínkách Banky (jedná se "]
[null,null,null,null,"zejména o příjmy z  úroků plynoucích vám v souvislosti s vedením účtu a příjmy z dividend), a že tyto příjmy jsou považovány za můj příjem dle daňového práva státu, ve kterém jsem daňovým rezidentem."]
[]
[null,null,null,"▪ že, pokud jsem výše uvedl stát daňové rezidence jiný než Spojené státy americké, nejsem U.S. osobou podle čl. 35.1. Všeobecných obchodních"]
[null,null,null,null,"podmínek Banky ani nesplňuji jinou indicii vazby na USA (místo narození, adresa pro doručování nebo bydliště, telefonní kontakt, trvalý příkaz propřevod prostředků na účet vedený v USA, poskytnutí plné moci nebo podpisové právo osobě s adresou v USA) splňující definiční podmínky dle Dohody FATCA."]
{"$rows_left_out":29}
{"sheet":"Zprostredkovani","index":5,"n_rows":12,"n_cols":13,"rows_kept":12,"cut":false,"hidden":false,"merged":[[0,0,1,17],[8,12,8,15],[7,12,7,15],[10,2,10,5],[11,2,11,5],[10,7,10,10],[11,7,11,10],[7,2,7,5],[8,2,8,5],[7,7,7,9],[8,7,8,10],[2,0,2,17]]}
["KB  KALKULAČKA SPOTŘEBITELSKÝCH ÚVĚRŮ"]
[]
["MODELACE ÚVĚRU A BONITA ŽADATEL > OSOBNÍ ÚDAJE  > PROHLÁŠENÍ ŽADATELE O VZTAHU KE KOMERČNÍ BANCE A JINÝCH INFORMACÍCH > INFORMACE O ZPROSTŘEDKOVATELI"]
[]
[]
[null,null,"Informace do potvrzení o zprostředkování"]
[]
[null,null,"Jméno a příjmení zprostředkovatele",null,null,null,null,"E-mail",null,null,null,null,"Identifikační číslo/IČO/RČ"]
[null,null,"",null,null,null,null,"",null,null,null,null,""]
[]
[null,null,"Název obchodní společnosti",null,null,null,null,"V obchodním místě"]
[null,null,"",null,null,null,null,""]

{"sheet":"Data_export","index":6,"n_rows":113,"n_cols":11,"rows_kept":113,"cut":false,"hidden":true,"merged":[[89,1,89,4],[89,7,89,10],[101,1,101,4],[1,0,1,3],[38,0,38,3],[38,6,38,9],[65,0,65,3],[74,0,74,3],[74,6,74,9],[9,0,9,3],[20,0,20,3],[20,6,20,9]]}
[]
["Klienti"]
[null,"Jméno Příjmení","Jmeno_Klient1",{"$f":"IF(OR(Zadost!C9=pomocne!B12,Zadost!C9=pomocne!B13,Zadost!C9=pomocne!B16,Zadost!C9=pomocne!B17,Zadost!C9=pomocne!B20,Zadost!C9=pomocne!B29),CONCATENATE(Zadost!F9,\" \",Zadost!I9,\", \",Zadost!C9),CONCATENATE(Zadost!C9,\" \",Zadost!F9,\" \",Zadost!I9))","v":"  "},"Zadost"]
[null,"Trvalý pobyt ","AdrTrvPobytKlient1",{"$f":"IF(Zadost!I15=\"\",\"\",Zadost!I15)","v":""},"Zadost"]
[null,"Rodné číslo/datum narození","RC_Klient1",{"$f":"IF(AND(Zadost!L9=\"\",Zadost!O9=\"\"),\"- / -\",IF(AND(Zadost!L9=\"\",Zadost!O9<>\"\"),\"- / \"&Zadost!O9,IF(AND(Zadost!L9<>\"\",Zadost!O9=\"\"),Zadost!L9&\" / -\",IF(AND(Zadost!L9<>\"\",Zadost!O9<>\"\"),Zadost!L9&\" / \"&Zadost!O9,))))","v":"- / -"},"Zadost"]
[null,"Jméno Příjmení","Jmeno_Klient2",{"$f":"IF(OR(Zadost!C52=pomocne!B12,Zadost!C52=pomocne!B13,Zadost!C52=pomocne!B16,Zadost!C52=pomocne!B17,Zadost!C52=pomocne!B20,Zadost!C52=pomocne!B29),CONCATENATE(Zadost!F52,\" \",Zadost!I52,\", \",Zadost!C52),CONCATENATE(Zadost!C52,\" \",Zadost!F52,\" \",Zadost!I52))","v":"  "},"Zadost"]
[null,"Trvalý pobyt ","AdrTrvPobytKlient2",{"$f":"IF(Zadost!I58=\"\",\"\",Zadost!I58)","v":""},"Zadost"]
[null,"Rodné číslo/datum narození","RC_Klient2",{"$f":"IF(AND(Zadost!L52=\"\",Zadost!O52=\"\"),\"- / -\",IF(AND(Zadost!L52=\"\",Zadost!O52<>\"\"),\"- / \"&Zadost!O52,IF(AND(Zadost!L52<>\"\",Zadost!O52=\"\"),Zadost!L52&\" / -\",IF(AND(Zadost!L52<>\"\",Zadost!O52<>\"\"),Zadost!L52&\" / \"&Zadost!O52,))))","v":"- / -"},"Zadost"]
[]
["Parametry úvěru"]
[null,"Druh úvěru","V_D1_cmbSmlouvaTyp_1",{"$f":"IF(Limit!C9=\"\",\"\",Limit!C9)","v":""},"Limit"]
[null,"Celková výše úvěru","V_D1_txtVyseUveru_1",{"$f":"IF(Limit!F9=\"\",\"\",Limit!F9)","v":""},"Limit"]
[null,"slovy","V_D1_txtSlovyVyseU_1",{"$f":"IF(Limit!F9=\"\",\"\",slovy(Limit!F9))","v":""},"Limit"]
[null,"Účelová část","V_D1_txtUcelVyseUv_1",null,"-"]
[null,"slovy","V_D1_txtSlovVyseUc_1",{"$f":"IF(Limit!F9=\"\",\"\",slovy(D14))","v":""},"-"]
[null,"Účel","V_D1_txtUcel_1",{"$f":"IF(Limit!C9=\"\",\"\",IF(Limit!C9=pomocne!G4,\"bez účelu\",\"konsolidace dluhů\"))","v":""},"funkce zde"]
[null,"Počet měsíčních splátek","PPC_DobaTrvaniM_1",{"$f":"IFERROR(IF(Limit!I9=\"\",\"\",Limit!I9)*12,\"\")","v":""},"Limit"]
[null,"Čerpání do","Cerpani_Do",{"$f":"pomocne!AH7","v":"2024-06-10"},"Pomocne"]
[null,"Zajištění úvěru","Zajisteni_Typ",{"$f":"IF(Limit!F12=\"\",\"\",Limit!F12)","v":""},"Limit"]
[]
{"$rows_left_out":94}
{"sheet":"Changelog","index":7,"n_rows":11,"n_cols":6,"rows_kept":11,"cut":false,"hidden":false,"merged":[]}
[]
[null,"Datum","Jméno","Verze vývoj","Úprava","Verze nasazena jako"]
[null,"2024-03-27","KPE","Kalkule_rdparty_v2.09","- všechny sazby na 5,9%","kalksu_v1.6"]
[null,"2022-04-07","KPE","Kalkule_rdparty_v2.08","- nejvyšší sazba na 6,9%","kalksu_v1.5"]
[null,"2022-04-07","KPE","Kalkule_rdparty_v2.07","- nejvyšší sazba na 5,5%","kalksu_v1.4"]
[null,"2022-03-21","KPE","Kalkule_rdparty_v2.06","- všechny sazby kromě nejvyšší na 5,9%","kalksu_v1.3"]
[null,"2020-12-14","TTO","Kalkule_rdparty_v2.05","- upraven odkaz na kalkulačku DP","kalksu_v1.2"]
[null,"2020-12-14","TTO","Kalkule_rdparty_v2.04","- všechny sazby kromě nejvyšší na 4,9%","kalksu_v1.1"]
[null,"2020-07-17","TTO","Kalkule_rdparty_v2.03","- upravena hranice pro sazbu 3,8 %","kalksu_v1.0"]
[null,"2020-04-13","TTO","Kalkule_rdparty_v2.02","- přidány odkazy na kalkulačku DP do nadpusu příjmů z podnikání\n- úprava textací","kalksu_v1.0"]
[null,"2020-04-13","TTO","Kalkule_rdparty_v2.01","- dopočet úrokové sazby dle výše úvěru\n- Upravena textace několika polí\n- nastaven poplatek u osobního úvěru na 490","kalksu_v1.0"]

{"sheet":"pomocne","index":8,"n_rows":724,"n_cols":45,"rows_kept":724,"cut":false,"hidden":true,"merged":[[59,1,59,5],[59,8,59,12]]}
["Informace pro seznamy",null,null,null,null,null,null,null,null,null,null,null,null,null,null,null,null,null,null,"Výpočet anuity",null,null,null,"Výpočet anuity",null,null,null,null,null,null,null,null,"Výpočet RPSN"]
[null,"titul","pohlaví","stav",null,null,"produkt","maturita","sazba","poplatek za sjednání","výpis BU",null,"děti","ANO/NE",null,null,null,null,null,"Celková výše úvěru",{"$f":"Limit!F9","v":0},null,null,null,null,"Celkem",{"$f":"SUM(AA4:AA301)","v":0},{"$f":"SUM(AB4:AB301)","v":0},{"$f":"SUM(AC4:AC301)","v":{"$error":"#VALUE!"}},null,null,null,"Celková výše úvěru",{"$f":"U2","v":0},null,null,"Výpočet RPSN"]
[null,null,null,null,null,null,null,null,null,null,null,null,null,null,null,null,null,null,null,"Úrok ",{"$f":"IFERROR(IF(Limit!F9=\"\",\"\",InterestRate(Limit!F9)),\"\")","v":""},null,null,null,"Platba","Datum splátky","Výše splátky","Z toho jistina","Z toho úrok","Zůstatek jistiny",null,null,"Úrok ","",null,null,null,"Platba","Datum platby","Typ platby","Výše úhrady","Dnů od čerpání","Dnů v roce","Část roku","Disk CF"]
["PŘED","Akad.","Muž","Svobodný(á)",null,null,"Osobní úvěr",1,3.7999999999999999E-2,0,0,null,0,"Ano",null,null,null,null,null,"Počet splátek",{"$f":"Limit!I9*12","v":0},null,null,0,0,null,null,null,null,{"$f":"U2","v":0},null,null,"Počet anuitní splátek",0,null,null,0,0,{"$f":"AH6","v":"2024-06-10"},"čerpání",{"$f":"-AH2","v":0},{"$f":"AM4-$AM$4","v":0},{"$f":"IF(OR(MOD(YEAR(AM4),400)=0,AND(MOD(YEAR(AM4),4)=0,MOD(YEAR(AM4),100)<>0)),366,365)","v":366},{"$f":"AP4/AQ4","v":0},{"$f":"AO4/(1+$AH$18)^AR4","v":0}]
["PŘED","Akad. arch.","Žena","Ženatý(á)",null,null,"Optimální půjčka",2,4.9000000000000002E-2,490,20,null,1,"Ne",null,null,null,null,null,"Datum podpisu smlouvy",{"$f":"TODAY()","v":"2024-06-10"},null,null,1,{"$f":"IF($U$4>=X5,X5,\"\")","v":""},{"$f":"IF(Y5=\"\",\"\",U10)","v":""},{"$f":"IF(Y5=\"\",\"\",AC5)","v":""},{"$f":"IF(Y5=\"\",\"\",AA5-AC5)","v":""},{"$f":"U2*U3/360*U15","v":{"$error":"#VALUE!"}},{"$f":"AD4-AB5","v":{"$error":"#VALUE!"}},null,null,"Datum podpisu smlouvy","2024-06-10",null,null,1,0,{"$f":"AH6","v":"2024-06-10"},"jednorázové poplatky",{"$f":"IF(AT5=\"Ano\",0,AH12)","v":490},{"$f":"AM5-$AM$4","v":0},{"$f":"IF(OR(MOD(YEAR(AM5),400)=0,AND(MOD(YEAR(AM5),4)=0,MOD(YEAR(AM5),100)<>0)),366,365)","v":366},{"$f":"AP5/AQ5","v":0},{"$f":"IF(AL5=\"\",\"\",AO5/(1+$AH$18)^AR5)","v":490}]
["PŘED","Akad. mal.",null,"Rozvedený(á)",null,null,null,3,6.9000000000000006E-2,null,null,null,2,null,null,null,null,null,null,"Datum započetí čerpání",{"$f":"TODAY()","v":"2024-06-10"},null,null,2,{"$f":"IF($U$4>=X6,X6,\"\")","v":""},{"$f":"IF(Y6=\"\",\"\",EDATE($Z$5,Y5))","v":""},{"$f":"IF(Y6=\"\",\"\",IF(Y6=$U$4,AD5+AC6,IF(Z6>=$U$12,$U$17,AC6)))","v":""},"",{"$f":"IF(Y6=\"\",\"\",(AD4*$U$3/12))","v":""},{"$f":"IF(Y6=\"\",\"\",AD5-AB6)","v":""},null,null,"Datum započetí čerpání","2024-06-10",null,null,2,1,{"$f":"Z5","v":""},"platba splátky",{"$f":"IF(AT5=\"Ano\",0,AA5)","v":""},{"$f":"AM6-$AM$4","v":{"$error":"#VALUE!"}},{"$f":"IF(OR(MOD(YEAR(AM6),400)=0,AND(MOD(YEAR(AM6),4)=0,MOD(YEAR(AM6),100)<>0)),366,365)","v":{"$error":"#VALUE!"}},{"$f":"AP6/AQ6","v":{"$error":"#VALUE!"}},{"$error":"#VALUE!"}]
["PŘED","Akad. soch.",null,"Vdovec/vdova",null,null,{"$f":"Limit!C9","v":0},5,8.8999999999999996E-2,null,null,null,3,null,null,null,null,null,null,"Datum dočerpání",{"$f":"TODAY()","v":"2024-06-10"},null,null,3,{"$f":"IF($U$4>=X7,X7,\"\")","v":""},"",{"$f":"IF(Y7=\"\",\"\",IF(Y7=$U$4,AD6+AC7,IF(Z7>=$U$12,$U$17,AC7)))","v":""},"",{"$f":"IF(Y7=\"\",\"\",(AD6*$U$3/12))","v":""},"",null,null,"Datum dočerpání","2024-06-10",null,null,3,{"$f":"IF($AH$13=0,IF($AH$4>=AK6,AK6,\"\"),IF($AH$11>=AK6,AK6,\"\"))","v":""},{"$f":"IF(AL7=\"\",\"\",IF($AH$13=0,EDATE(AM6,1),IF(ISEVEN(AL7)=TRUE,EOMONTH(AM6,0),EDATE(CONCATENATE(DAY($AH$8),\".\",MONTH(AM6),\".\",YEAR(AM6)),1))))","v":""},{"$f":"IF(AL7=\"\",\"\",IF(DAY(AM7)=DAY($AH$8),\"platba splátky\",\"platba poplatků\"))","v":""},{"$f":"IF(AL7=\"\",\"\",IF(AT7=\"Ano\",0,IF(AN7=\"platba splátky\",VLOOKUP(AM7,Z:AA,2,FALSE),$AH$13)))","v":""},{"$f":"IF(AL7=\"\",\"\",AM7-$AM$4)","v":""},{"$f":"IF(AL7=\"\",\"\",IF(OR(MOD(YEAR(AM7),400)=0,AND(MOD(YEAR(AM7),4)=0,MOD(YEAR(AM7),100)<>0)),366,365))","v":""},{"$f":"IF(AL7=\"\",\"\",AP7/AQ7)","v":""},""]
["PŘED","Arch.",null,"Druh/družka",null,null,null,6,0.109,null,null,null,4,null,null,null,null,null,null,"Den pro splácení","20.",null,null,4,"","","","","","",null,null,"Datum první splátky",{"$f":"U10","v":"20.06.2024"},null,null,4,"","","","","",{"$f":"IF(AL8=\"\",\"\",IF(OR(MOD(YEAR(AM8),400)=0,AND(MOD(YEAR(AM8),4)=0,MOD(YEAR(AM8),100)<>0)),366,365))","v":""},{"$f":"IF(AL8=\"\",\"\",AP8/AQ8)","v":""},""]
["PŘED","Bc.",null,"Registrovaný partner(ka)",null,null,null,7,0.129,null,null,null,5,null,null,null,null,null,null,"Celková splatná částka",null,null,null,5,"","","","","","",null,null,"Datum poslední splátky",{"$f":"VLOOKUP(AH4,AL:AM,2,FALSE)","v":"2024-06-10"},null,null,5,"","","","","","","",""]
["PŘED","BcA",null,null,null,null,null,8,null,null,null,null,6,null,null,null,null,null,null,"Datum první úrokové splátky",{"$f":"IF(MONTH(U5)>9,\n\nIF(DAY(U5)<20,CONCATENATE(20,\".\",MONTH(U5),\".\",YEAR(U5)),EDATE(CONCATENATE(20,\".\",MONTH(U5),\".\",YEAR(U5)),1)),\n\nIF(DAY(U5)<20,CONCATENATE(20,\".0\",MONTH(U5),\".\",YEAR(U5)),EDATE(CONCATENATE(20,\".0\",MONTH(U5),\".\",YEAR(U5)),1)))","v":"20.06.2024"},null,null,6,"","","","","","",null,null,"Datum posledního poplatku",{"$f":"IF(AH13=0,\"-\",IF(AH14=\"bude účtován\",EOMONTH(AH9,0),EOMONTH(AH9,-1)))","v":"-"},null,null,6,"","","","","","","",""]
["PŘED","BcA.",null,null,null,null,null,null,null,null,"OKEČ",null,null,null,"Ostatní příimy",null,null,null,null,"Datum poslední splátky úroků",{"$f":"IF(MONTH(U5)>9,\n\nIF(DAY(U5)<20,CONCATENATE(20,\".\",MONTH(U5),\".\",YEAR(U5)),EDATE(CONCATENATE(20,\".\",MONTH(U5),\".\",YEAR(U5)),1)),\n\nIF(DAY(U5)<20,CONCATENATE(20,\".0\",MONTH(U5),\".\",YEAR(U5)),EDATE(CONCATENATE(20,\".0\",MONTH(U5),\".\",YEAR(U5)),1)))","v":"20.06.2024"},null,null,7,"","","","","","",null,null,"Údaje pro výpočet RPSN - doplnit",{"$f":"IF(AH14=\"bude účtován\",AH4*2,AH4*2-1)","v":-1},null,null,7,"","","","","","","",""]
["ZA","CSc.",null,null,null,null,null,"Počet konsolidovaných",null,null,null,null,null,null,null,null,null,null,null,"Datum první anuitní splátky",{"$f":"EDATE(U11,1)","v":"2024-07-20"},null,null,8,"","","","","","",null,null,"Poplatek za zpracování žádosti",490,null,null,8,"","","","","","","",""]
["Za","DiS.",null,null,null,null,null,null,null,null,"Zemědělství, lesnictví, rybolov",null,null,null,"Z pronájmu nemovitosti ",null,null,null,null,"Počet anuitních splátek",{"$f":"U4-(DATEDIF(U10,U11,\"m\")+1)","v":-1},null,null,9,"","","","","","",null,null,"Pravidelné měsiční poplatky",0,null,null,9,"","","","","","","",""]
["PŘED","doc.",null,"Vzdělání",null,null,null,1,null,null,"Těžba a zpracování nerostných surovin",null,null,null,"Spolupracující osoby FOP",null,null,null,null,null,null,null,null,10,"","","","","","",null,null,"Poslední pravidelný poplatek","nebude účtován",null,null,10,"","","","","","","",""]
["PŘED","Dr.",null,null,null,null,null,2,null,null,"Potravinářská výroba",null,null,null,"Ostatní prokazatelné příjmy ",null,null,null,null,"Počet dní do první splátky",{"$f":"DAYS360(U5,U10)","v":10},null,null,11,"","","","","","",null,null,null,null,null,null,11,"","","","","","","",""]
["ZA","dr.h.c.",null,"Základní škola",null,null,null,3,null,null,"Textilní a kožedělný průmysl",null,null,null,"Skupina doplňkových příjmů ",null,null,null,null,"Vzorec",{"$f":"U2*(1+U3/12)^U13*(1+U3/12-1)/((1+U3/12)^U13-1)","v":{"$error":"#VALUE!"}},null,null,12,"","","","","","",null,null,"Celková splatná částka",{"$f":"SUM(AO5:AO724)","v":490},null,null,12,"","","","","","","",""]
["ZA","DrSc.",null,"Střední škola",null,null,null,4,null,null,"Dřevařský a papírenský průmysl",null,null,null,null,null,null,null,null,"KB výše anuitní splátky",{"$f":"IF(U4=0,\"\",CEILING(U16,1))","v":""},null,null,13,"","","","","","",null,null,"Součet pro iteraci",{"$f":"SUM(AS4:AS1000)","v":{"$error":"#VALUE!"}},null,null,13,"","","","","","","",""]
["PŘED","Ing.",null,"Střední škola s maturitou, VOS",null,null,null,5,null,null,"Tiskařský a polygrafický průmysl",null,null,null,null,null,null,null,null,"Výše poslední splátky",{"$f":"VLOOKUP(U4,Y:AA,3,FALSE)","v":0},null,null,14,"","","","","","",null,null,"RPSN ",5.0611865420747165E-2,null,null,14,"","","","","","","",""]
["PŘED","JUDr.",null,"VŠ - bakalářské studium",null,null,null,6,null,null,"Chemický a farmaceutický průmysl",null,null,null,null,null,null,null,null,"Rozdíl mezi splátkami",{"$f":"U17-U18","v":{"$error":"#VALUE!"}},null,null,15,"","","","","","",null,null,null,null,null,null,15,"","","","","","","",""]
["Za","M.B.A.",null,"VŠ - inženýrské, magisterské studium",null,null,null,7,null,null,"Hutnictví, kovovýroba",null,null,null,null,null,null,null,null,null,null,null,null,16,"","","","","","",null,null,null,null,null,null,16,"","","","","","","",""]
{"$rows_left_out":704}